exportações
type: Concept
preferred label: Esportazioni @it
preferred label: 輸出 @ja-jp
preferred label: Exportations @fr
preferred label: exports @en-gb
preferred label: Export @de
preferred label: exportaciones @es
definition: 自国で生産/製造された後、他の地域に配送し、販売すること @ja-jp
definition: Es lo que se produce y se fabrica en su propio país, y se envía y vende en otro lugar. @es
definition: Aquilo que é produzido ou manufaturado num país e é enviado para fora para ser vendido.
definition: Beni prodotti e/o confezionati in un paese per poi essere inviati e venduti in altri paesi; Merci nazionali destinate all'estero @it
definition: What is produced or manufactured in your country and sent and sold elsewhere @en-gb
definition: Aquilo que é produzido ou manufaturado em um país e é enviado para fora para ser vendido.
definition: Alles was im eigenen Land hergestellt und produziert und überallhin verkauft und versendet wird. @de
definition: La vente et le transport à l'étranger des produits nationaux @fr
note: nessuno @it
in scheme: subjectcode
created: 2003-04-05T12:00:00+00:00
modified: 2012-07-10T12:00:00+00:00
broader: http://cv.iptc.org/newscodes/subjectcode/04008000