Accordi commerciali
type: Concept
preferred label: acordos comerciais @pt-pt
preferred label: 貿易協定 @ja-jp
preferred label: trade agreements @en-gb
preferred label: acuerdos comerciales @es
preferred label: Accords commerciaux @fr
preferred label: Handelsabkommen @de
definition: Accordi fra nazioni o gruppi di nazioni riguardanti reciproci privilegi nell'import-export
definition: Acuerdo el gobierno entre países para la compra y venta de bienes y servicios. @es
definition: 商品やサービスの販売や購入に関する政府間協定 @ja-jp
definition: Acordo governamental entre países para a compra e venda de bens e serviços. @pt-pt
definition: Verträge zwischen Ländern auf Regierungsebene für den An- und Verkauf von Gütern und Dienstleistungen. @de
definition: Les accords commerciaux entre pays pour l'achat et la vente de biens et services @fr
definition: Government level agreements between countries for the sale and purchase of goods and services @en-gb
note: nessuno
in scheme: subjectcode
created: 2003-04-05T12:00:00+00:00
modified: 2012-07-10T12:00:00+00:00
broader: http://cv.iptc.org/newscodes/subjectcode/04008000