Imprese
type: Concept
preferred label: Unternehmen @de
preferred label: Entrepises @fr
preferred label: empresas @es
preferred label: business enterprises @en-gb
preferred label: 企業 @ja-jp
definition: Affaire ou entreprise créé dans le but de faire des bénéfices en créant ou en vendant un produit ou un service @fr
definition: Imprese con scopo di lucro creando e vendendo un prodotto o un servizio
definition: Organizaciones que generalmente están dirigidas a beneficencia creando y vendiendo un producto o servicio. @es
definition: Zusammenschlüsse, die ein Produkt oder Dienstleistung anbieten, mit der Absicht diese gewinnbringend zu verkaufen. @de
definition: Organizations set up usually for profit-making purposes by creating and selling a product or service @en-gb
definition: Organizações estabelecidas com fins lucrativos, mediante a criação e venda de um produto ou serviço. @pt-br
definition: 主に、製品やサービスを生み出したり、販売することによって利益を得ることを目的として設立された組織 @ja-jp
note: nessuno
in scheme: subjectcode
created: 2003-04-05T12:00:00+00:00
modified: 2012-07-10T12:00:00+00:00
broader: http://cv.iptc.org/newscodes/subjectcode/04008000