Bilancia commerciale
type: Concept
preferred label: 貿易収支 @ja-jp
preferred label: Balance commerciale @fr
preferred label: balança comercial @pt-br
preferred label: trade balance @en-gb
preferred label: balanza de cambios @es
preferred label: Handelsbilanz @de
definition: la diferencia entre el valor financiero de las importaciones y exportaciones. @es
definition: Differenza in valore finanziario tra le importazioni e le esportazioni
definition: Diferença entre o valor financeiro de importações e exportações. @pt-pt
definition: Die finanzielle Differenz zwischen Import und Export in Bezug auf den Warenwert. @de
definition: Différence entre la valeur financière des importations et des exportations @fr
definition: 輸入と輸出の金融価値の差異 @ja-jp
definition: The difference between the financial value of imports and exports @en-gb
note: nessuno
in scheme: subjectcode
created: 2004-10-13T12:00:00+00:00
modified: 2012-07-10T12:00:00+00:00
broader: http://cv.iptc.org/newscodes/subjectcode/04008000