Mercati, Borse
type: Concept
preferred label: mercado e câmbios @pt-pt
preferred label: market and exchange @en-gb
preferred label: mercados y bolsas @es
preferred label: Marchés @fr
preferred label: Markt und Börse @de
preferred label: 取引所 @ja-jp
definition: Entidades organizadas para a compra e venda de ações, divisas, matérias-primas e outros bens. @pt-br
definition: Organisierte Körperschaften, die Aktien, Währungen, Rohstoffe und andere Güter kaufen und verkaufen. @de
definition: Entidades organizadas para la compra y venta de stocks, monedas, propiedades y otros bienes. @es
definition: 株式、通貨、産物、日用品、その他の商品を売買するための組織 @ja-jp
definition: Enti organizzati per la compravendita di azioni, valute, materie prime ed altri beni
definition: Organized entities for buying and selling stocks, currencies, commodities and other goods @en-gb
definition: Entité organisée dans la vente et l'achat d'actions, de monnaies, de matières premières et autres biens @fr
note: nessuno
in scheme: subjectcode
created: 2000-10-30T12:00:00+00:00
modified: 2010-12-15T17:01:09+00:00
broader: http://cv.iptc.org/newscodes/subjectcode/04000000
narrower: http://cv.iptc.org/newscodes/subjectcode/04009001
narrower: http://cv.iptc.org/newscodes/subjectcode/04009002
narrower: http://cv.iptc.org/newscodes/subjectcode/04009003
narrower: http://cv.iptc.org/newscodes/subjectcode/04009004