Energia
type: Concept
preferred label: energia @pt-pt
preferred label: Energie @de
preferred label: Marché énergie @fr
preferred label: energía @es
preferred label: energy @en-gb
preferred label: エネルギー取引所 @ja-jp
definition: Stories related to energy trading and markets @en-gb
definition: Artikel im Kontext von Energiehandel und Energiemarkt. @de
definition: Les histoires liées au marché et à la vente d'énergie @fr
definition: エネルギー貿易と市場に関連する記事 @ja-jp
definition: Histórias relativas ao comércio e mercados energéticos. @pt-br
definition: Historias relacionadas al comercio y mercados energéticos @es
definition: Mercati per il commercio dell'energia
note: nessuno
in scheme: subjectcode
created: 2000-10-30T12:00:00+00:00
modified: 2010-12-15T17:01:09+00:00
broader: http://cv.iptc.org/newscodes/subjectcode/04009000