Metallo
type: Concept
preferred label: Métaux @fr
preferred label: metal @pt-br
preferred label: Metall @de
preferred label: metales @es
preferred label: 金属取引所 @ja-jp
definition: 銅、アルミ、鋼鉄、亜鉛などの卑金属の取引に関する市場 @ja-jp
definition: Markets for trading base metals such as copper, aluminium, steel, zinc etc @en-gb
definition: Mercados para comercializar metais básicos como cobre, alumínio, aço, zinco, etc. @pt-br
definition: Mercati per il commercio dei metalli come rame, alluminio, ferro, zinco, ecc...
definition: Mercados para transar metales básicos como cobre, aluminio, acero, cinc, etc. @es
definition: Les bourses aux métaux : cuivre, aluminium, fer, zinc, etc. @fr
definition: Märkte um Metalle wie Kupfer, Aluminium, Stahl und Zink etc. zu handeln. @de
note: nessuno
in scheme: subjectcode
created: 2000-10-30T12:00:00+00:00
modified: 2010-12-15T17:01:09+00:00
broader: http://cv.iptc.org/newscodes/subjectcode/04009000