Titoli, Valori mobiliari
type: Concept
preferred label: bolsa @pt-br
preferred label: Wertpapier @de
preferred label: valores @es
preferred label: securities @en-gb
preferred label: 証券取引所 @ja-jp
preferred label: Bourse @fr
definition: Märkte um festverzinsliche Wertpapiere und Aktien zu handeln. @de
definition: Mercati per il commercio dei titoli
definition: Mercados para comercializar tipos de documentos como ações e obrigações. @pt-pt
definition: 株式や債券などの会社が発行する様々な種類の有価証券を取引する市場 @ja-jp
definition: Mercados para transar documentos tales como acciones y bonos. @es
definition: Markets for trading types of company paper such as stocks and bonds @en-gb
definition: Les bourses de titres où s'échangent actions et obligations @fr
note: nessuno
in scheme: subjectcode
created: 2000-10-30T12:00:00+00:00
modified: 2010-12-15T17:01:09+00:00
broader: http://cv.iptc.org/newscodes/subjectcode/04009000