Beni non durevoli
type: Concept
preferred label: soft commodities @pt-pt
preferred label: Bonds und Futures/Obligation @de
preferred label: soft commodity @en-gb
preferred label: Denrées ?????????? @fr
preferred label: 商品取引所 @ja-jp
preferred label: productos textiles @es
definition: Transação de matérias-primas como algodão, açúcar, sorgo, soja, etc. @pt-pt
definition: Commercio riguardante prodotti come cotone, zucchero, sorgo, soia, ecc...
definition: Les bourses de matières premières telles que le coton, le sucre, etc. @fr
definition: Transacciones de surtidos tales como algodón, azucar, granos, legumbres, etc. @es
definition: Handel mit Rohstoffen wie Baumwolle, Zucker, Zuckerrohr, Sojabohnen etc. @de
definition: Trading in commodities such as cotton, sugar, sorghum, soybeans etc. @en-gb
definition: 綿、砂糖、もろこし、大豆など金属以外の取引 @ja-jp
note: nessuno
in scheme: subjectcode
created: 2000-10-30T12:00:00+00:00
modified: 2010-12-15T17:01:09+00:00
broader: http://cv.iptc.org/newscodes/subjectcode/04009000