Editoria
type: Concept
preferred label: mercado livreiro @pt-pt
preferred label: édition @fr
preferred label: 出版 @ja-jp
preferred label: libros @es
preferred label: Bücher/Verlag @de
preferred label: book @en-gb
definition: フィクション、ノンフィクションにかかわらず、装丁(製本)されたものを、製作したり売ったりする商売 @ja-jp
definition: La production et la vente de textes écrits qu'ils soient de fiction ou non @fr
definition: Negócio de produção e venda de publicações, seja de ficção ou de não ficção. @pt-pt
definition: The business of producing and selling bound media, whether fiction or non-fiction @en-gb
definition: Produzione e vendita di mezzi di comunicazione stampati
definition: EL negocio de producir y vender publicaciones, ya sean de ficción o no ficción. @es
definition: Das Geschäft gebundene Medien zu produzieren und zu verkaufen, sowohl Belletristik als auch Sachliteratur. @de
note: nessuno
in scheme: subjectcode
created: 2000-10-30T12:00:00+00:00
modified: 2010-12-15T17:01:09+00:00
broader: http://cv.iptc.org/newscodes/subjectcode/04010000