Agenzie di stampa
type: Concept
preferred label: Agences de presse @fr
preferred label: Nachrichtenagentur @de
preferred label: agencias noticiosas @es
preferred label: news agency @en-gb
preferred label: agências noticiosas @pt-br
preferred label: 通信社 @ja-jp
definition: Kommerzielle Agenturen, die nachrichtenrelevante Ereignisse aufbereiten und verbreiten durch Presse, Fernsehen, Video oder elektronische Medien. @de
definition: Agenzie d'informazione che producono e diffondono notizie attraverso supporti di vario genere: stampa, trasmissioni, video o mezzi elettronici, ecc.
definition: Agencias comerciales para la producción y distribución de eventos noticiosos a traves de texto, transmisión, video o medios electrónicos. @es
definition: Agências comerciais que produzem e distribuem eventos noticiosos por escrito, por rádio ou televisão, por vídeo ou por meios eletrônicos. @pt-br
definition: Commercial agencies for production and distribution of newsworthy events through print, broadcast, video or electronic media @en-gb
definition: Sociétés commerciales produisant et hiérarchisant l'information et la distribuant par écrit, par radio, par vidéo ou par média électronique @fr
definition: Agências comerciais que produzem e distribuem eventos noticiosos por escrito, por rádio ou televisão, por vídeo ou por meios eletrónicos. @pt-pt
definition: 印刷、放送、ビデオあるいは電子メディアを使って、報道価値のある出来事の著作および配布を行う商業機関 @ja-jp
note: nessuno
in scheme: subjectcode
created: 2000-10-30T12:00:00+00:00
modified: 2010-12-15T17:01:09+00:00
broader: http://cv.iptc.org/newscodes/subjectcode/04010000