Elettrodomestici
type: Concept
preferred label: electrical appliance @en-gb
preferred label: Elektroindustrie @de
preferred label: équipement électrique @fr
preferred label: material elétrico @pt-br
preferred label: artefactos eléctricos @es
preferred label: 電機 @ja-jp
definition: Fabricantes de produtos elétricos para uso doméstico ou industrial. @pt-br
definition: Makers of large and small electrical goods for use in homes or business @en-gb
definition: Produzione di grandi e piccoli elettrodomestici per il loro uso in casa o per aziende
definition: Fabricantes de productos eléctricos para el uso industrial o domestico. @es
definition: Fabricants de matériel électrique @fr
definition: Hersteller von großen und kleinen Elektrowaren für den privaten und geschäftlichen Gebrauch. @de
definition: 家庭または企業で使われる大小電気製品のメーカー @ja-jp
note: Explanation added in V 15 @fr
note: nessuno
in scheme: subjectcode
created: 2004-10-13T12:00:00+00:00
modified: 2012-07-10T12:00:00+00:00
broader: http://cv.iptc.org/newscodes/subjectcode/04011000