Ingegneria pesante
type: Concept
preferred label: equipamentos pesados @pt-pt
preferred label: heavy engineering @en-gb
preferred label: ingeniería pesada @es
preferred label: Anlagenbau @de
preferred label: Mécanique lourde @fr
preferred label: 重工業 @ja-jp
definition: Fabricantes de gruas, buldôzeres e equipamento similar para uso em grandes projetos de construção. @pt-br
definition: 大規模な建設事業に使用するクレーン、ブルドーザやそれに準ずる重機の製造業者 @ja-jp
definition: Manufacturers of cranes, bulldozers and the like for use in major construction projects @en-gb
definition: Fabricantes de gruas, buldózeres e equipamento similar para uso em grandes projetos de construção. @pt-pt
definition: Diseñadores y manufacturadores de gruas, palas mecánicas y otros similares, que son utilizados en grandes construcciones. @es
definition: Herstellung von Krähnen, Bulldozern und ähnliches für den Gebrauch bei großen Bauprojekten. @de
definition: Fabricants de matériel lourd pour les grands projets de construction @fr
definition: Produzione di gru, bulldozer e simili per il loro uso nei grandi progetti di costruzione
note: nessuno
note: Explanation added in V 15 @fr
in scheme: subjectcode
created: 2004-10-13T12:00:00+00:00
modified: 2012-07-10T12:00:00+00:00
broader: http://cv.iptc.org/newscodes/subjectcode/04011000