Siderurgia
type: Concept
preferred label: Sidérurgie @fr
preferred label: iron and steel @en-gb
preferred label: ferro e aço @pt-br
preferred label: fierro y acero @es
preferred label: 鉄鋼 @ja-jp
preferred label: Eisen/Stahl @de
definition: Mineração, refinação e venda de metais ferrosos. @pt-pt
definition: Gewinnung, Verfeinerung und Verkauf von eisenhaltigen Metallen. @de
definition: La production, la transformation et la vente des métaux ferreux @fr
definition: Mineria, refinamiento y venta de metales a base de hierro. @es
definition: 鉄基金属の採掘、精製、販売 @ja-jp
definition: Mining, refining and sales of iron-based metals @en-gb
definition: Estrazione, raffinazione e vendita di metalli a base di ferro
note: nessuno
in scheme: subjectcode
created: 2000-10-30T12:00:00+00:00
modified: 2010-12-15T17:01:09+00:00
broader: http://cv.iptc.org/newscodes/subjectcode/04012000