Distillerie, Birrerie
type: Concept
preferred label: Boissons alcoolisées @fr
preferred label: destilação e bebidas @pt-pt
preferred label: distiller and brewer @en-gb
preferred label: Alkoholische Getränke/Brauerei @de
preferred label: destilerías y cervecerías @es
preferred label: 醸造 @ja-jp
definition: Produzione di bevande alcoliche
definition: Fabrico de bebidas alcoólicas. @pt-pt
definition: Herstellung alkoholischer Getränke. @de
definition: Manufacture of alcoholic beverages @en-gb
definition: アルコール飲料の製造 @ja-jp
definition: L'industrie de fabrication de boissons alcooliques @fr
definition: Fabricación de bebidas alcoholicas. @es
note: nessuno
in scheme: subjectcode
created: 2000-10-30T12:00:00+00:00
modified: 2010-12-15T17:01:09+00:00
broader: http://cv.iptc.org/newscodes/subjectcode/04013000