Carta, Imballaggi
type: Concept
preferred label: 製紙 @ja-jp
preferred label: papel e embalagem @pt-pt
preferred label: Papier/Verpackung @de
preferred label: paper and packaging product @en-gb
preferred label: Papier et emballage @fr
preferred label: productos de papel y embalaje @es
definition: Produktion von Papiermaterial zum Schreiben, Einwickeln, Drucken oder Verpacken. @de
definition: Produção papel para escrever, embrulhar, imprimir ou embalar. @pt-pt
definition: Producción de materiales de papel para escribir, envolver, imprimir o empacar. @es
definition: Production of paper material for writing, wrapping, printing, or packaging @en-gb
definition: 書き物用、包装用、印刷用、梱包用の紙製品の生産 @ja-jp
definition: La papeterie, le papier d'imprimerie et d'emballage @fr
definition: Produzione di materiale cartaceo per scrivere, incartare, stampare o imballare
note: nessuno
in scheme: subjectcode
created: 2000-10-30T12:00:00+00:00
modified: 2010-12-15T17:01:09+00:00
broader: http://cv.iptc.org/newscodes/subjectcode/04013000