Gomma
type: Concept
preferred label: ゴム製品 @ja-jp
preferred label: productos de caucho @es
preferred label: rubber product @en-gb
preferred label: borracha @pt-pt
preferred label: Gummi @de
preferred label: Caoutchouc @fr
definition: Produzione di articoli a base di gomma per guanti, rivestimenti protettivi, manichette, ecc.
definition: Production of rubber based materials for gloves, protective coatings, hoses and the like @en-gb
definition: Herstellung von gummibasierten Materialien wie Handschuhe, Schutzmäntel, Schläuchen und Ähnliches. @de
definition: Produção de materiais de borracha para o fabrico de luvas, revestimentos protetores, mangueiras, etc. @pt-pt
definition: 手袋、保護皮膜、ホースなどのゴム製品の生産 @ja-jp
definition: Produits à base de caoutchouc tels que les gants et les revêtements protecteurs, les tuyaux, etc. @fr
definition: Producción de materiales de goma para la fabricación de guantes, trajes protectores, mangueras y otros similares. @es
note: nessuno
in scheme: subjectcode
created: 2000-10-30T12:00:00+00:00
modified: 2010-12-15T17:01:09+00:00
broader: http://cv.iptc.org/newscodes/subjectcode/04013000