Analcolici
type: Concept
preferred label: soft drinks @en-gb
preferred label: Nicht alkoholische Getränke @de
preferred label: 清涼飲料 @ja-jp
preferred label: bebidas no alcohólicas @es
preferred label: Boissons non alcoolisées @fr
preferred label: refrigerantes @pt-br
definition: Herstellung nicht-alkoholischer Getränke. @de
definition: Production of non-alcoholic drinks @en-gb
definition: Fabrico de bebidas não alcoólicas. @pt-br
definition: La production de boissons sans alcool @fr
definition: Produzione di bevande analcoliche
definition: Producción de bebidas no alcoholicas. @es
definition: アルコールが入っていない飲料の生産 @ja-jp
note: nessuno
in scheme: subjectcode
created: 2000-10-30T12:00:00+00:00
modified: 2010-12-15T17:01:09+00:00
broader: http://cv.iptc.org/newscodes/subjectcode/04013000