Tabacchi
type: Concept
preferred label: Tabak @de
preferred label: tabaco @pt-pt
preferred label: Tabac @fr
preferred label: tobacco @en-gb
preferred label: たばこ @ja-jp
definition: La culture, la production et la vente des produits du tabac @fr
definition: Anbau, Produktion und Handel mit Tabakprodukten. @de
definition: Cultivo, produção e venda de produtos do tabaco. @pt-pt
definition: Growing, producing and sale of tobacco products @en-gb
definition: Coltura, produzione e vendita di prodotti del tabacco
definition: タバコの栽培と生産、およびタバコ製品の販売 @ja-jp
definition: Cultivar, producir y vender productos de tabaco. @es
note: nessuno
in scheme: subjectcode
created: 2000-10-30T12:00:00+00:00
modified: 2010-12-15T17:01:09+00:00
broader: http://cv.iptc.org/newscodes/subjectcode/04013000