cassinos e jogo
type: Concept
preferred label: Casinos @fr
preferred label: ギャンブル @ja-jp
preferred label: casinos e jogo
preferred label: Casinò, Giochi @it
preferred label: casinos y juegos de azar @es
preferred label: casino and gambling @en-gb
preferred label: Glücksspielbetrieb @de
definition: カード、サイコロ、動物のレースに賭けるためのルーレットなどを利用する様々な「チャンスのゲーム」の販路を提供するビジネス @ja-jp
definition: Das Geschäft mit dem Angebot von verschiedenen Glücksspielen, wie Kartenspiel, Würfel, Lotto, Toto, Pferdewetten. @de
definition: Negócio do jogo, desde as instalações para vários jogos de azar, usando cartas, dados, roletas, até apostas em corridas de animais.
definition: El negocio que provee intslaciones para juegos de azar, cartas, dados, ruletas con apuestas o carreras de animales. @es
definition: Tout ce qui va des établissements de jeux de hasard aux paris sur les courses d'animaux @fr
definition: The business of providing outlets for various games of chance using cards, dice, spinning wheels to betting on animal races @en-gb
definition: Produzione di installazioni per il gioco d'azzardo e/o le scommesse di varia natura @it
note: nessuno @it
in scheme: subjectcode
created: 2000-10-30T12:00:00+00:00
modified: 2010-12-15T17:01:09+00:00
broader: http://cv.iptc.org/newscodes/subjectcode/04014000