Alberghiero
type: Concept
preferred label: Gastgewerbe @de
preferred label: hotelaria e alojamentos @pt-pt
preferred label: hotel and accommodation @en-gb
preferred label: ホテル・旅館 @ja-jp
preferred label: hoteles y alojamiento @es
preferred label: Hotellerie @fr
definition: Negocio que provee comida y hospedaje a los viajeros. @es
definition: 旅行客に食物・住まいを供給するビジネス @ja-jp
definition: Negócio que fornece comida e alojamento a viajantes. @pt-br
definition: L'hébergement et la restauration des voyageurs @fr
definition: Industria alberghiera
definition: The business of providing food and shelter to travellers @en-gb
definition: Das Arbeitsfeld, Reisenden Verpflegung und Unterkunft anzubieten. @de
note: nessuno
in scheme: subjectcode
created: 2000-10-30T12:00:00+00:00
modified: 2010-12-15T17:01:09+00:00
broader: http://cv.iptc.org/newscodes/subjectcode/04014000