Aerei
type: Concept
preferred label: aviação @pt-br
preferred label: 空運 @ja-jp
preferred label: Luftverkehr @de
preferred label: Transport aérien @fr
preferred label: air transport @en-gb
preferred label: transporte aéreo @es
definition: 飛行機と空港の運営(運用) @ja-jp
definition: Aviones y operaciones de aeropuestos. @es
definition: Operações de aviões e de aeroportos. @pt-pt
definition: Airplane and airport operations @en-gb
definition: Les opérations aéroportuaires et de transport par air @fr
definition: Aktivitäten um Flugzeuge und Flughäfen. @de
definition: Sistema del trasporto aereo, le operazioni aeree ed aeroportuali
note: nessuno
in scheme: subjectcode
created: 2000-10-30T12:00:00+00:00
modified: 2010-12-15T17:01:09+00:00
broader: http://cv.iptc.org/newscodes/subjectcode/04015000