transporte ferroviário
type: Concept
preferred label: ferrocarril @es
preferred label: Ferrovie @it
preferred label: Bahn @de
preferred label: 鉄道 @ja-jp
preferred label: Transport ferroviaire @fr
preferred label: railway @en-gb
definition: 鉄道による人々や積荷を輸送するビジネス @ja-jp
definition: Geschäft mit dem Transport von Menschen und Ware auf der Schiene. @de
definition: negocio de transporte de pasajeros o carga, a través de tren. @es
definition: Trasporto di persone o merci su rotaie @it
definition: Le transport de voyageurs et de marchandises par train @fr
definition: The business of transporting people or cargo by rail @en-gb
definition: Negócio do transporte de pessoas ou carga por comboio.
definition: Negócio do transporte de pessoas ou carga por trem
note: nessuno @it
in scheme: subjectcode
created: 2000-10-30T12:00:00+00:00
modified: 2010-12-15T17:01:09+00:00
broader: http://cv.iptc.org/newscodes/subjectcode/04015000