transporte rodoviário
type: Concept
preferred label: 陸運 @ja-jp
preferred label: transporte carretero @es
preferred label: Transport routier @fr
preferred label: Stradali @it
preferred label: Straßenverkehr @de
preferred label: road transport @en-gb
definition: トラックと公道による輸送物のビジネス @ja-jp
definition: Negocio de transporte de bienes mediante camiones, a través de las carretereas. @es
definition: Negócio do transporte de mercadorias por camião e autoestrada.
definition: Le transport de marchandises par camion et par route @fr
definition: Geschäft mit dem Transport von Waren durch LKW's und Straßen. @de
definition: Trasporto di merci tramite autocarri e TIR su strade ed autostrade @it
definition: Negócio do transporte de mercadorias por caminhão e rodovia.
definition: The business of transport goods by trucks and highways @en-gb
note: nessuno @it
in scheme: subjectcode
created: 2000-10-30T12:00:00+00:00
modified: 2010-12-15T17:01:09+00:00
broader: http://cv.iptc.org/newscodes/subjectcode/04015000