contabilidade e auditoria
type: Concept
preferred label: Buchführung/Bilanzprüfung @de
preferred label: 会計監査 @ja-jp
preferred label: accounting and audit @en-gb
preferred label: Comptabilité et audit @fr
preferred label: contabilidad y auditoría @es
preferred label: Rendicontazione, Verifica @it
definition: Changes in choice of auditing firm. Reports on impact of changes in GAAP. @en-gb
definition: Cambios en la forma de auditar firmas. Reportes del impacto de cambios en GAAP. @es
definition: Les changements de sociétés d'audit et les rapports sur l'impact des modifications comptables @fr
definition: Valutazione di informazioni finanziarie ed esame da parte di esperti terzi dei documenti finanziari ; Revisione contabile e certificazione @it
definition: 会計検査をしている企業の選択の変化。GAAPで変化のインパクトについて報告する @ja-jp
definition: Mudanças na escolha de sociedade de auditoria. Relatórios sobre o impacto de mudanças nos princípios contábeis geralmente aceitos.
definition: Mudanças na escolha de sociedade de auditoria. Relatórios sobre o impacto de mudanças nos princípios contabilísticos geralmente aceites.
definition: Änderungen in der Wahl der Buchhaltungsfirma. Berichte über Auswirkungen von Änderungen in den Standards des Rechnungswesens GAAP/ IAS/ HGB. @de
note: nessuno @it
in scheme: subjectcode
created: 2000-10-30T12:00:00+00:00
modified: 2010-12-15T17:01:09+00:00
broader: http://cv.iptc.org/newscodes/subjectcode/04016000