Relazioni annuali
type: Concept
preferred label: 年次報告 @ja-jp
preferred label: relatório anual @pt-pt
preferred label: Geschäftsbericht @de
preferred label: Rapports annuels @fr
preferred label: memorias anuales @es
preferred label: annual report @en-gb
definition: Histórias relativas à disponibilidade ou aos conteúdos de relatórios anuais de empresas. @pt-br
definition: Pubblicazioni e contenuti delle relazioni annuali delle società
definition: Historias informando disponibilidad de reportes anuales de las compañías o sus contenidos. @es
definition: La publication et le contenu des rapports annuels de sociétés @fr
definition: 入手可能性に関連するストーリー、あるいは年に一度の会社報告のコンテンツ @ja-jp
definition: Availability or contents of annual company reports. @en-gb
definition: Die Verwendbarkeit oder Inhalte von Jahresabschlussberichten von Firmen. @de
note: nessuno
in scheme: subjectcode
created: 2000-10-30T12:00:00+00:00
modified: 2010-12-15T17:01:09+00:00
broader: http://cv.iptc.org/newscodes/subjectcode/04016000