antitruste
type: Concept
preferred label: antitrust issue @en-gb
preferred label: 独占禁止 @ja-jp
preferred label: Antitrust @it
preferred label: Kartellfragen @de
preferred label: problemas antimonopolio @es
preferred label: antitrust
preferred label: Problèmes de concurrence @fr
definition: Histórias relativas a atividades antitruste, regulações de monopólio, etc.
definition: Histórias relativas a atividades antitrust, regulações de monopólio, etc.
definition: Kartellaktivitäten und Wettbewerbsrichtlinien. @de
definition: 独占禁止の活動、独占規制、などに関連するストーリー @ja-jp
definition: Tout ce qui concerne les activités antitrust, la législation sur les monopoles, etc. @fr
definition: Attività dell'antritrust, la legislazione sui monopoli, ecc... @it
definition: Historias sobre actividades antimonopólicas, regulaciones, etc. @es
definition: Antitrust activities, monopoly regulation, etc. @en-gb
note: nessuno @it
in scheme: subjectcode
created: 2000-10-30T12:00:00+00:00
modified: 2010-12-15T17:01:09+00:00
broader: http://cv.iptc.org/newscodes/subjectcode/04016000