Consigli Amministrazione
type: Concept
preferred label: board of directors (appointment and change) @en-gb
preferred label: directorio - cambios y designaciones @es
preferred label: Carnet des entreprises @fr
preferred label: conselhos de administração @pt-br
preferred label: Geschäftsführung/Vorstand @de
preferred label: 役員人事 @ja-jp
definition: Appointments to or changes in the board of directors for a company. @en-gb
definition: Notícias sobre nomeações ou mudanças no conselho de administração de uma companhia. @pt-pt
definition: Nomine o sostituzioni nei consigli d'amministrazione delle società
definition: 企業取締役会の任命、変更に関するニュース @ja-jp
definition: Absprachen oder Wechsel in der Geschäftsführung eines Unternehmens. @de
definition: Noticias sobre reuniones o cambios en los directorios de compañías. @es
definition: Les informations sur les nominations et les changements au sein des conseils d'administration de sociétés @fr
note: nessuno
in scheme: subjectcode
created: 2000-10-30T12:00:00+00:00
modified: 2010-12-15T17:01:09+00:00
broader: http://cv.iptc.org/newscodes/subjectcode/04016000