Riacquisto Azioni
type: Concept
preferred label: recompra @pt-br
preferred label: recompras @es
preferred label: Aktienrückkauf @de
preferred label: 株買い戻し @ja-jp
preferred label: buyback @en-gb
preferred label: Rachats d'actions @fr
definition: Notícias sobre programas de recompra de ações. Deve ser mantido distinto de atividade bolsista (ver abaixo). @pt-pt
definition: Les informations relatives aux programmes de rachat d'actions @fr
definition: 株買戻しに関する情報。一般的な株取引とは違う @ja-jp
definition: Stock buyback programs. This should be kept distinct from Stock Activity (see below). @en-gb
definition: Aktienrückkaufprogramme. Dies sollte getrennt geführt werden von Aktienbewegung (s.u). @de
definition: Informazioni sui programmi per il riacquisto di azioni, da distinguere dall'attività azionaria
definition: Noticias sobre programas de recompra de acciones. Debe guardar distinción con Actividad Accionaria (ver más abajo) @es
note: nessuno
in scheme: subjectcode
created: 2000-10-30T12:00:00+00:00
modified: 2010-12-15T17:01:09+00:00
broader: http://cv.iptc.org/newscodes/subjectcode/04016000