Previsioni profitti
type: Concept
preferred label: Gewinnprognose @de
preferred label: Prévisions de résultats @fr
preferred label: pronóstico de utilidades @es
preferred label: 収益見通し @ja-jp
preferred label: previsão de lucros @pt-pt
preferred label: earnings forecast @en-gb
definition: Analyst prediction of company earnings. @en-gb
definition: Previsões dos analistas sobre os lucros de empresas. @pt-pt
definition: Les prévisions ou estimations sur les revenus des sociétés @fr
definition: Predicciones de analistas sobre utilidades de compañías. @es
definition: 会社事業所得のアナリスト予測 @ja-jp
definition: Previsioni o stime riguardanti gli utili delle società
definition: Vorhersage von Firmenumsätzen durch Analysten. @de
note: nessuno
in scheme: subjectcode
created: 2000-10-30T12:00:00+00:00
modified: 2010-12-15T17:01:09+00:00
broader: http://cv.iptc.org/newscodes/subjectcode/04016000