Aziende depresse
type: Concept
preferred label: empresa com dificuldades financeiras @pt-br
preferred label: Unternehmenskrise @de
preferred label: Entreprise en difficulté @fr
preferred label: empresas con problemas financieros @es
preferred label: 経営不振 @ja-jp
preferred label: financially distressed company @en-gb
definition: Noticias de empresas penalizadas financieramente, no llegando aún a la quiebra. @es
definition: Notícias sobre empresas com dificuldades financeiras mas que ainda não declararam falência. @pt-br
definition: Les Informations sur les sociétés en difficulté mais pas encore en faillitte déclarée @fr
definition: 会社が財政的に苦しめられるというニュース-まだ破産を登録しなかったこと @ja-jp
definition: Ein ist Unternehmen finanziell in Bedrängnis, hat aber noch nicht Konkurs angemeldet. @de
definition: Informazioni riguardanti società finanziariamente in difficoltà ma non ancora fallite
definition: Aa company is financially distressed - not yet having filed for bankruptcy. @en-gb
note: nessuno
in scheme: subjectcode
created: 2000-10-30T12:00:00+00:00
modified: 2010-12-15T17:01:09+00:00
broader: http://cv.iptc.org/newscodes/subjectcode/04016000