Joint Venture
type: Concept
preferred label: operaciones conjuntas @es
preferred label: 合弁事業 @ja-jp
preferred label: joint venture @en-gb
preferred label: Entreprise en participation @fr
preferred label: Joint Ventures @de
definition: Notícias sobre joint ventures entre companhias (não relacionadas ao marketing - ver Marketing). @pt-br
definition: Noticias sobre negocios conjuntos entre compañías (no relacionadas con Marketing - ver marketing) @es
definition: Notícias sobre joint ventures entre companhias (não relacionadas com marketing - ver Marketing). @pt-pt
definition: Kooperationsvereinbarung über den gemeinsamen Betrieb von Unternehmen, die einzubringenden Kapitalien, das zu liefernde Know-how, die aufzuteilenden Gewinne. Nicht in bezug auf Marketing. @de
definition: Accordi di collaborazione da cui derivano società controllate congiuntamente dalle imprese che li hanno conclusi
definition: 会社間のジョイントヴェンチャーに関するニュース(マーケティングとは関連しませんが-マーケティングを見て下さい) @ja-jp
definition: Joint ventures between companies. (Not marketing related - see Marketing.) @en-gb
definition: Informations relatives aux joint ventures (sauf celles liées au marketing) @fr
note: nessuno
in scheme: subjectcode
created: 2000-10-30T12:00:00+00:00
modified: 2010-12-15T17:01:09+00:00
broader: http://cv.iptc.org/newscodes/subjectcode/04016000