Licenziamenti, Ridimensionamenti
type: Concept
preferred label: despidos y reducciones de tamaño @es
preferred label: 人員削減 @ja-jp
preferred label: Entlassung und Rationalisierung @de
preferred label: redução de efetivos @pt-pt
preferred label: Restructurations @fr
preferred label: layoffs and downsizing @en-gb
definition: Riduzioni programmate o attuate della forza lavoro all'interno delle aziende
definition: 計画的なあるいは実際の労働力の減少 @ja-jp
definition: Geplante oder aktuell durchgeführte Minimierung der Arbeitskräfte/Ressourcen. @de
definition: Reducciones actuales o planificadas en la fuerza laboral de empresas. @es
definition: Planned or actual reductions in the labour force. @en-gb
definition: Licenciements et plans sociaux @fr
definition: Reduções reais ou previstas da força de trabalho de uma empresa. @pt-pt
note: nessuno
in scheme: subjectcode
created: 2000-10-30T12:00:00+00:00
modified: 2010-12-15T17:01:09+00:00
broader: http://cv.iptc.org/newscodes/subjectcode/04016000