Accordi di licenza
type: Concept
preferred label: contratos de concesión de licencia @es
preferred label: Lizenz @de
preferred label: ライセンス契約 @ja-jp
preferred label: contrato de licença @pt-br
preferred label: licensing agreement @en-gb
preferred label: Accords de licence @fr
definition: ライセンスしている会社の合意についてのストーリー @ja-jp
definition: Lizenzvereinbarungen zwischen zwei Vertragspartnern. @de
definition: Accordi tra le società per concessioni di licenze
definition: Licensing agreements between companies. @en-gb
definition: Histórias sobre contratos de licença entre companhias. @pt-pt
definition: Accords de licence entre les sociétés @fr
definition: Historias acuerdos en la concesión de licencias entre compañías. @es
note: nessuno
in scheme: subjectcode
created: 2000-10-30T12:00:00+00:00
modified: 2010-12-15T17:01:09+00:00
broader: http://cv.iptc.org/newscodes/subjectcode/04016000