Contenziosi, Regolamenti
type: Concept
preferred label: Unternehmensrecht @de
preferred label: litigation and regulation @en-gb
preferred label: litigios y reglamentaciones @es
preferred label: 企業訴訟 @ja-jp
preferred label: litígios e regulamentações @pt-br
preferred label: Contentieux @fr
definition: Corporate law including litigation and regulations. @en-gb
definition: Informations relatives au droit des sociétés y compris les litiges et les réglementations @fr
definition: Histórias sobre direito empresarial, incluindo litígios e regulações. @pt-br
definition: 訴訟、および規制を含む会社法律をみなすストーリー @ja-jp
definition: Historias sobre leyes corporativas, incluyendo litigios y regulaciones. @es
definition: Firmengesetze inklusive Rechtsstreitigkeiten und Regelungen. @de
definition: Il diritto societario, i regolamenti e le controversie legali
note: nessuno
in scheme: subjectcode
created: 2000-10-30T12:00:00+00:00
modified: 2010-12-15T17:01:09+00:00
broader: http://cv.iptc.org/newscodes/subjectcode/04016000