Cambi Management
type: Concept
preferred label: Führungswechsel @de
preferred label: mudanças de gestores @pt-pt
preferred label: 人事異動 @ja-jp
preferred label: cambios en la gerencia @es
preferred label: Modification de l'organigramme @fr
preferred label: management change @en-gb
definition: 会社役員レベル以下のマネージメントの主要な任命、または変更 @ja-jp
definition: Cambios en la administración bajo el nivel de gerente general @es
definition: Nomeações e mudanças importantes na administração, abaixo do nível dos quadros superiores. @pt-br
definition: Nominations et changements importants dans l'encadrement hors cadres supérieurs @fr
definition: Größere Anstellungen oder Wechsel in der Ebene unterhalb der Geschäftsführung. @de
definition: Nomine o sostituzioni nel management
definition: Major appointments or changes in management below the level of corporate officer. @en-gb
note: nessuno
in scheme: subjectcode
created: 2000-10-30T12:00:00+00:00
modified: 2010-12-15T17:01:09+00:00
broader: http://cv.iptc.org/newscodes/subjectcode/04016000