Aperture Stabilimenti
type: Concept
preferred label: abertura de fábrica @pt-pt
preferred label: Ouvertures d'usines @fr
preferred label: plant opening @en-gb
preferred label: Betriebseröffnung @de
preferred label: 工場新設 @ja-jp
preferred label: aperturas de plantas @es
definition: Anuncios de apertura de plantas actuales o planificados. @es
definition: Anúncios de abertura ou de previsão de abertura de fábricas. @pt-pt
definition: L'annonce d'ouverture d'usines présentes ou à venir @fr
definition: Ankündigung geplanter oder aktueller Eröffnungen von Betrieben. @de
definition: Announcements of planned or actual plant openings. @en-gb
definition: Annunci riguardanti progettate o attuate aperture di impianti o fabbriche
definition: 計画的なあるいは実際のプラント･オープニングのアナウンス @ja-jp
note: nessuno
in scheme: subjectcode
created: 2000-10-30T12:00:00+00:00
modified: 2010-12-15T17:01:09+00:00
broad match: http://cv.iptc.org/newscodes/mediatopic/20000170
broader: http://cv.iptc.org/newscodes/subjectcode/04016000