Rating
type: Concept
preferred label: 格付け @ja-jp
preferred label: rating @pt-pt
preferred label: clasificaciones @es
preferred label: Indice et classement @fr
preferred label: Kreditwürdigkeit @de
definition: Classificações de dívida e de crédito corporativos e soberanos (e.g. S&P ou Moody's). @pt-br
definition: Clasificaciones de deuda y solvencia corporativa y soberana (Ej.: StandP o Moody's). @es
definition: Kollektive und individuelle Schulden und Kredit-Ratings (z.B SandP oder Moody's). @de
definition: Corporate and sovereign debt and credit ratings (e.g. SandP or Moody's) @en-gb
definition: 法人の、また主権がある負債、および債券格付け(例えばSandP、あるいはムーディーの) @ja-jp
definition: La notation des entreprises (ex: Standard and Poors ou Moody) @fr
definition: Classificazione e valutazione secondo determinati indici della qualità dei titoli o della solidità finanziaria (ad es. S&P o Moody's)
note: nessuno
in scheme: subjectcode
created: 2000-10-30T12:00:00+00:00
modified: 2010-12-15T17:01:09+00:00
broader: http://cv.iptc.org/newscodes/subjectcode/04016000