Ricerche, Sviluppo
type: Concept
preferred label: Forschung und Entwicklung @de
preferred label: Recherche et developpement @fr
preferred label: pesquisa e desenvolvimento @pt-br
preferred label: research and development @en-gb
preferred label: 研究・開発 @ja-jp
preferred label: investigación y desarrollo @es
definition: Notícias sobre investigação e despesas relativas ao desenvolvimento de novos produtos. @pt-pt
definition: Forschung und Ausgaben für die Entwicklung neuer Produkte. @de
definition: Research and expenditure on new product development. @en-gb
definition: Noticias sobre investigación e inversión en desarrollo de nuevos productos. @es
definition: Informazioni sulla ricerca e lo sviluppo di nuovi prodotti
definition: 新しい製品開発の支出と研究に関してのニュース @ja-jp
definition: Informations sur la recherche et le développement de nouveaux produits @fr
note: nessuno
in scheme: subjectcode
created: 2000-10-30T12:00:00+00:00
modified: 2010-12-15T17:01:09+00:00
broader: http://cv.iptc.org/newscodes/subjectcode/04016000