Comunicazioni finanziarie trimestrali, semestrali
type: Concept
preferred label: situação financeira trimestral ou semestral @pt-pt
preferred label: quarterly or semiannual financial statement @en-gb
preferred label: Quartals- und Halbjahresbilanz @de
preferred label: estados financieros trimestrales o semestrales @es
preferred label: 決算 @ja-jp
preferred label: Comptes trimestriels et semestriels @fr
definition: 入手可能性に関連するストーリー、あるいは季別のあるいは半年毎の企業レポートのコンテンツ @ja-jp
definition: Historias sobre la disponibilidad o contenido de memorias corporativas trimestrales o semestrales. @es
definition: Pubblicazione dei rapporti o del contenuto dei rapporti trimestrali o semestrali delle imprese
definition: Availability or contents of quarterly or semi-annual corporate reports. @en-gb
definition: Histórias relativas à disponibilidade ou aos conteúdos de relatórios trimestrais ou semestrais de empresas. @pt-pt
definition: La publication des rapports trimestriels ou semestriels des entreprises @fr
definition: Verfügbarkeit oder Inhalt von Quartals- oder Halbjahresbilanzen von Firmen. @de
note: nessuno
in scheme: subjectcode
created: 2000-10-30T12:00:00+00:00
modified: 2010-12-15T17:01:09+00:00
broader: http://cv.iptc.org/newscodes/subjectcode/04016000