Ricapitalizzazioni
type: Concept
preferred label: reestruturação e recapitalização @pt-br
preferred label: reestructuración, recapitalización @es
preferred label: リストラ @ja-jp
preferred label: Recapitalisation @fr
preferred label: Neufinanzierung und Umstrukturierung @de
preferred label: restructuring and recapitalisation @en-gb
definition: Sale of company units, splits of existing companies into units under a holding company, etc. @en-gb
definition: Les histoires relatives à la restructuration des entreprises, vente par appartement, création de holdings, etc. @fr
definition: Histórias relativas à venda de unidades de negócio, à separação de empresas existentes em unidades de negócio de holdings, etc. @pt-br
definition: Verkauf von Unternehmensteilen, Aufsplittung von bestehenden Unternehmen in Teile einer Holding etc. @de
definition: Historias sobre la venta de unidades de negocio o compras de compañías como unidades de negocio de holdings, etc. @es
definition: Ristrutturazioni attraverso la vendita di unità produttive, divisione delle società sotto una holding, ecc.
definition: 企業単位、持ち株会社下の既存企業の分割単位の売上を含むストーリー @ja-jp
note: nessuno
in scheme: subjectcode
created: 2000-10-30T12:00:00+00:00
modified: 2010-12-15T17:01:09+00:00
broader: http://cv.iptc.org/newscodes/subjectcode/04016000