Spin-Off
type: Concept
preferred label: Essaimage @fr
preferred label: spin-off @en-gb
preferred label: escisiones @es
preferred label: 分離独立 @ja-jp
preferred label: Ausgründung @de
definition: Creazione di nuove società dallo scorporo di compagnie preesistenti
definition: Historias sobre la creación de nuevas compañías a partir de divisiones de compañías existentes. @es
definition: 既存企業から分離されて新しいカンパニーの創設に関するストーリー @ja-jp
definition: Histórias relativas à criação de empresas novas a partir de divisões de empresas existentes. @pt-pt
definition: Les histoires concernant la création d'entreprises nouvelles issues de sociétés existantes @fr
definition: Gründung neuer Firmen, die sich aus bestehenden Firmen ausgegliedert haben. @de
definition: Creation of new companies being spun off from existing companies. @en-gb
note: nessuno
in scheme: subjectcode
created: 2000-10-30T12:00:00+00:00
modified: 2010-12-15T17:01:09+00:00
broader: http://cv.iptc.org/newscodes/subjectcode/04016000