produtividade
type: Concept
preferred label: Produttività @it
preferred label: Produktivität @de
preferred label: 生産性 @ja-jp
preferred label: productivity @en-gb
preferred label: producción @es
preferred label: Productivité @fr
definition: Custo de produção de um item de valor, geralmente medido como o rendimento por hora e por pessoa.
definition: Custo de produção um item de valor, geralmente medido como o rendimento por hora e por pessoa.
definition: The cost of labour to produce an item of value, often measured as output per hour per person @en-gb
definition: ひとつの価値あるものを生み出すための労働コスト。しばしば、一人の人間の一時間の生産高で計られる @ja-jp
definition: Costo de trabajo para producir un ítem de valor, generalmente medido como el rendimiento por hora y por persona. @es
definition: Le coût du travail par rapport au coût de production d'un bien @fr
definition: Die Arbeitskosten etwas zu produzieren, meist berechnet durch die Leistung pro Stunde pro Person. @de
definition: Costo del lavoro per la produzione di un bene di un determinato valore, spesso misurato come rendimento orario per persona @it
note: nessuno @it
in scheme: subjectcode
created: 2003-04-05T12:00:00+00:00
modified: 2012-07-10T12:00:00+00:00
broader: http://cv.iptc.org/newscodes/subjectcode/04016000