Inventari
type: Concept
preferred label: inventários @pt-pt
preferred label: inventories @en-gb
preferred label: Inventur @de
preferred label: Stocks @fr
preferred label: 在庫 @ja-jp
preferred label: inventarios @es
definition: Bens que não foram vendidos e que permanecem no produtor, grossista ou retalhista. @pt-pt
definition: L'ensemble des marchandises en stock @fr
definition: Goods not sold and held by the producer, wholesaler or retailer @en-gb
definition: 生産者、卸売業者あるいは小売り業者によって、売られずに保管されている商品 @ja-jp
definition: Bens que não foram vendidos e que permanecem no produtor, atacadista ou varejista. @pt-br
definition: Insieme dei beni non venduti e tenuti dal produttore, grossista o dettagliante
definition: Bienes que el productor, vendedor en mayoría y minorista no vende ni tiene. @es
definition: Waren, die unverkauft in der Produktion, beim Verteiler oder im Großhandel bleiben. @de
note: nessuno
in scheme: subjectcode
created: 2003-04-05T12:00:00+00:00
modified: 2012-07-10T12:00:00+00:00
broader: http://cv.iptc.org/newscodes/subjectcode/04016000