Società
type: Concept
preferred label: 会社 @ja-jp
preferred label: grandes empresas @pt-pt
preferred label: Personne morale @fr
preferred label: corporaciones @es
preferred label: Gesellschafter @de
preferred label: corporations @en-gb
definition: Companhias de negócios formalmente autorizadas com conselhos de administração e estruturas hierárquicas. @pt-br
definition: Business enterprises formally licensed with boards of directors and hierarchical structures of governance @en-gb
definition: Entreprises formellement constituées avec un conseil d'administration et des structures hiérarchiques de gouvernement @fr
definition: Empresas formalmente autorizadas con juntas de directores y estructuras de jerarquía de mando. @es
definition: Imprese formalmente costituite con consigli di amministrazione e strutture di direzione; Società di capitali; Società per azioni
definition: 取締役会や階層的な統治する機構から形式的に認められた商業的な事業体 @ja-jp
definition: Wirtschaftsunternehmen, die formal durch eine Geschäftsführungsbenene und eine hierarchische Führungsstruktur genehmigt sind. @de
note: nessuno
in scheme: subjectcode
created: 2003-04-05T12:00:00+00:00
modified: 2012-07-10T12:00:00+00:00
broader: http://cv.iptc.org/newscodes/subjectcode/04016000