Frazionamenti azionari
type: Concept
preferred label: distribución de acciones @es
preferred label: Aktiensplitting @de
preferred label: 株式分割 @ja-jp
preferred label: desdobramento de ações @pt-pt
preferred label: échanges d'actions @fr
preferred label: stock splits @en-gb
definition: Emitir múltiples acciones de una. Generalmente ocurre cuando el precio de una acción ha aumentado tanto que su precio de compra ya no resulta atractiva. Lo contrario sucede cuando se emite una acción para generar múltiples acciones, para elevar el valor @es
definition: Bei einem Aktiensplit wird der aktuelle Aktienbestand einer AG in mehr Aktien aufgeteilt, weil. Dadurch werden Aktien mit sehr hohem Kursniveau optisch günstiger und attraktiver. @de
definition: Emissão de ações múltiplas. Ocorre quando o preço de uma ação aumentou tanto que o seu preço de compra deixou ser atrativo. O contrário sucede quando uma ação é emitida para troca de múltiplas ações, para aumentar o valor por ação se for muito baixo. @pt-pt
definition: Issuing multiple shares for one share of stock. Usually occurs when the price of a stock has increased so much that its purchase price is not attractive. A reverse split is when one share is issued for multiple shares, to raise the per share value. @en-gb
definition: Emissão de ações múltiplas. Ocorre quando o preço de uma ação aumentou tanto que seu preço de compra deixou ser atrativo. O contrário sucede quando uma ação é emitida para troca de múltiplas ações, para aumentar o valor por ação se for muito baixo. @pt-br
definition: Frammentazioni di azioni uniche in varie azioni, con l'emissione di esse. Di solito si verifica quando il prezzo di un'azione aumenta a tal punto che che il suo valore d'acquisto non è attraente.
definition: Emission de nouvelles actions échangeables contre une ancienne (quand le prix de l'action est trop haut pour être attractif) et inversement, émission d'une nouvelle action échangeable contre X anciennes (pour faire monter le prix s'il est trop bas) @fr
definition: 一株を分割し、多数の株式を発行することを言う。普通はその株の購入価格が魅力的ではなく、株価が高値の時に発生する。その逆に統合は一株あたりの株価を上げるために多数の株式を一つにまとめる @ja-jp
note: nessuno
in scheme: subjectcode
created: 2003-04-05T12:00:00+00:00
modified: 2012-07-10T12:00:00+00:00
broader: http://cv.iptc.org/newscodes/subjectcode/04016000