Consumatori
type: Concept
preferred label: Verbraucher @de
preferred label: Consommateurs @fr
preferred label: 消費者 @ja-jp
preferred label: consumidores @pt-br
preferred label: consumers @en-gb
definition: Buyers of goods and services @en-gb
definition: Käufer von Waren und Dienstleistungen. @de
definition: Chi compra beni e/o servizi
definition: Comprador de bens e serviços. @pt-br
definition: 商品およびサービスの買手 @ja-jp
definition: Compradores de bienes y servicios @es
definition: Les acheteurs de biens et de services @fr
note: nessuno
in scheme: subjectcode
created: 2003-04-05T12:00:00+00:00
modified: 2012-07-10T12:00:00+00:00
broader: http://cv.iptc.org/newscodes/subjectcode/04016000