Nuovi Servizi
type: Concept
preferred label: new service @en-gb
preferred label: serviço novo @pt-pt
preferred label: nuevo servicio @es
preferred label: 新サービス @ja-jp
preferred label: Nouvelle activité @fr
preferred label: Neuangebot @de
definition: Nuevos servicios agregados por una compañía, tales como nuevas rutas de vuelo, etc. @es
definition: Novos serviços criados por uma companhia, como novas rotas de voo, etc. @pt-pt
definition: Nuovi servizi introdotti da una compagnia o società, ad es. nuove rotte aeree, ecc...
definition: Neues Angebot eines Unternehmens, wie neue Flugrouten etc. @de
definition: New services added by a company, such as new flight routes, etc. @en-gb
definition: Nouveaux services créés par une compagnie comme de nouvelles routes aériennes @fr
definition: 例えば、新しい航空路のように、会社が追加した新しいサービス @ja-jp
note: nessuno
in scheme: subjectcode
created: 2004-10-13T12:00:00+00:00
modified: 2012-07-10T12:00:00+00:00
broader: http://cv.iptc.org/newscodes/subjectcode/04016000