Economia (generico)
type: Concept
preferred label: Wirtschaft @de
preferred label: economy (general) @en-gb
preferred label: economia (geral) @pt-pt
preferred label: économie @fr
preferred label: 経済（一般） @ja-jp
preferred label: economía (general) @es
definition: 通商と経済についての一般的な性質に関する内容 @ja-jp
definition: Economia e Commercio in senso generale
definition: Conteúdo geral sobre comércio e economia. @pt-br
definition: L'économie et le commerce en général @fr
definition: Inhalte grundsätzlicher Art über Handel und Ökonomie. @de
definition: Contenido sobre el comercio y la economía en general @es
definition: Content of a general nature about trade and the economy @en-gb
note: nessuno
in scheme: subjectcode
created: 2000-10-30T12:00:00+00:00
modified: 2010-12-15T17:01:09+00:00
broader: http://cv.iptc.org/newscodes/subjectcode/04000000
narrower: http://cv.iptc.org/newscodes/subjectcode/04017001