Adulti
type: Concept
preferred label: Formation permanente @fr
preferred label: Erwachsenenbildung @de
preferred label: educación de adultos @es
preferred label: 成人教育 @ja-jp
preferred label: adult education @en-gb
preferred label: educação de adultos @pt-br
definition: L'enseignement aux plus de 25 ans @fr
definition: Educação fornecida a estudantes mais velhos do que o grupo usual entre os 5 e os 25 anos. @pt-pt
definition: Education provided for older students outside the usual age groups of 5-25 @en-gb
definition: Ausbildung für ältere Lernende außerhalb der gewöhnlichen Altersgruppe der 5-25-jährigen. @de
definition: 通常教育を受ける5才から25才より上の世代へ提供される教育 @ja-jp
definition: Educacion brindada a estudiantes mayres fuera del grupo usual de entre 5 y 25 años. @es
definition: Istruzione riguardante individui di età generalmente superiore ai 25 anni
note: nessuno
in scheme: subjectcode
created: 2000-10-30T12:00:00+00:00
modified: 2010-12-15T17:01:09+00:00
broader: http://cv.iptc.org/newscodes/subjectcode/05000000